{"text_format":"1","workbook":"xlsx","n_sheets":7,"sheets":["Mode Emploi","Exigences","Résultats globaux","Résultats par Article","Conseils","Plans d'action détaillés","Déclaration ISO 17050"],"not_rendered":{"charts":11,"images":5,"macros":1,"external_links":0,"defined_names":15,"comments":1,"pivot_tables":0},"unopened":[],"bounds":{"document_bytes":16777216,"sheet_cells":100000,"rows_first":2000,"rows_last":500,"rows_between":2000,"halvings":0,"cell_chars":16384,"cell_head_chars":4096},"cells_cut":0,"cells_raw":0,"read":"whole","date_system":"1900"}

{"sheet":"Mode Emploi","index":0,"n_rows":22,"n_cols":14,"rows_kept":22,"cut":false,"hidden":false,"merged":[[13,1,13,9],[4,1,4,3],[4,4,4,9],[15,1,15,2],[3,1,3,9],[8,1,8,9],[9,1,12,9],[14,5,14,9],[5,4,5,9],[6,8,6,9],[14,1,14,4],[21,1,21,9],[16,1,16,2],[15,8,15,9],[16,8,16,9],[20,1,20,9],[19,1,19,2],[18,1,18,2],[17,1,17,2],[17,8,17,9],[18,8,18,9],[19,8,19,9],[1,3,1,9],[5,1,5,3],[6,1,6,3],[6,4,6,7],[2,3,2,9]]}
[null,"Document d'appui à la déclaration première partie de conformité à la norme ISO 9001:2015",null,null,null,null,null,null,null,"Enregistrement qualité :  A4 100% vertical"]
[null,null,null,"   Autodiagnostic selon la norme ISO 9001:2015"]
[null,null,null,"\"Systèmes de management de la qualité - Exigences\", édition  Afnor, \nwww.afnor.org, octobre 2015"]
[null,"Attention : Seules les cases blanches écrites en bleu peuvent être modifiées par l’utilisateur. Cela concerne toutes les parties de l’outil"]
[null,"Etablissement :",null,null,"Nom de l'établissement / entreprise / organisation..."]
[null," Responsable du SMQ : ",null,null,"NOM et Prénom du Responsable Qualité"]
[null," Contact du Responsable du SMQ :",null,null,"email :",null,null,null,"Tél :"]
[]
[null,"Mode d'emploi"]
[null,"OBJECTIF:   \nCet outil permet aux différents utilisateurs, et en particulier aux responsables qualité d'un organisme, d'évaluer la conformité du système de management de la qualité selon les exigences de la norme ISO 9001:2015. Il sert aussi de tableau de bord pour votre système de management de la qualité avec lequel vous pouvez commenter et évaluer la progression de votre SMQ. Ainsi, il vous donnera plus de visibilité afin d'élaborer des actions d'amélioration continue. \n(NB : Cet outil ne garantit pas une certification)\n\nPRESENTATION DES ELEMENTS:  \nLa grille se présente sous format Excel constitué de 4 ongletsprincipaux :\n    - Mode d'emploi :\n         * Explicite le fonctionnement de l'outil et les critères d'évaluation définis\n    - Exigences : \n         * Des critères d'évaluation par article et sous article sont définis\n         * Des commentaires explicitent les critères aux utilisateurs\n    - Résultats globaux :\n         * Tous les résultats sont réunis sur cet onglet avec une cartographie globale du SMQ\n    - Résultats par article : \n         * Taux de CONFORMITÉ sous forme radar\n         * Les plans d'action prioritaires à mettre en œuvre et à déployer (Quoi, Qui, Quand...)                                                                                                            * Expliquent globalement l'objet de chaque article de la norme"]
[]
[null,null,null,null,null,null,null,null,null,null,null,null,"Utilitaires pour l'Autodiagnostic"]
[null,null,null,null,null,null,null,null,null,null,null,null,"Paramétrage des affectations selon le N° du choix"]
[null,null,null,null,null,null,null,null,null,null,null,null,"Utilisé pour  {Exigences} : affectation d'un N° selon le choix réalisé"]
[null,"Niveaux de VÉRACITÉ quant à la RÉALISATION \ndes actions associées aux exigences de la norme",null,null,null,"LIBELLÉS des niveaux de CONFORMITÉ \ndes ARTICLES de la norme ",null,null,null,null,null,null,"Choix proposé","A faire en manuel\nN° du choix croissant selon son  Ordre Alphabétique : 1 à …"]
{"$rows_left_out":8}
{"sheet":"Exigences","index":1,"n_rows":199,"n_cols":30,"rows_kept":199,"cut":false,"hidden":false,"merged":[[13,29,13,31],[14,29,14,31],[12,29,12,31],[194,4,194,5],[180,4,180,5],[181,4,181,5],[186,4,186,5],[101,4,101,5],[102,4,102,5],[111,4,111,5],[175,4,175,5],[162,4,162,5],[163,4,163,5],[169,4,169,5],[152,4,152,5],[156,4,156,5],[136,4,136,5],[142,4,142,5],[122,4,122,5],[65,4,65,5],[79,4,79,5],[88,4,88,5],[93,4,93,5],[84,4,84,5],[64,4,64,5],[32,4,32,5],[33,4,33,5],[3,5,7,5],[11,4,11,5],[15,4,15,5],[24,4,24,5],[4,2,4,4],[10,4,10,5],[59,4,59,5],[47,4,47,5],[48,4,48,5],[53,4,53,5],[39,4,39,5],[43,4,43,5],[1,1,1,5],[19,4,19,5],[3,0,3,1],[2,0,2,1],[2,2,2,5],[3,2,3,4],[5,2,5,3],[4,0,5,1],[6,0,7,1],[6,2,7,4]]}
[{"$f":"'Mode Emploi'!B1","v":"Document d'appui à la déclaration première partie de conformité à la norme ISO 9001:2015"},null,null,null,null,"Impression sur pages A4 100% en format horizontal"]
[null,"  Autodiagnostic sur les exigences de l'ISO 9001:2015",null,null,null,null,null,null,null,null,null,null,null,null,null,null,"Somme des pondérations des Articles","Taux moyen de conformité sur la Norme","Niveau de RESPECT pour la norme"]
[{"$f":"'Mode Emploi'!B5","v":"Etablissement :"},null,{"$f":"'Mode Emploi'!E5","v":"Nom de l'établissement / entreprise / organisation..."},null,null,null,null,null,null,null,"Somme des pondérations sur les exigences","Taux  moyen de CONFORMITÉ pour le sous-article","Niveau de RESPECT pour le sous-article","Automatique : pondération de chaque sous- chapitre","Taux  moyen de CONFORMITÉ pondéré pour le sous-article"]
["Date de l'autodiagnostic : ",null,null,null,null,"Signature du responsable de l'autodiagnostic :\n\n\n\n\n"]
["Responsable : ",null,"NOM et Prénom",null,null,null,null,"Choix réalisé","N° du choix réalisé","% Véracité du choix","Automatique : pondération de chaque exigence","Taux de CONFORMITÉ pondéré sur l'exigence",null,null,null,"Resultats, Actions et REX "]
[null,null,"Tél :",null,"@ :"]
["L'équipe :",null,"Noms et Prénoms des participants"]
[]
[]
["Réf.","Critères d'exigence des articles de la norme","Evaluations","Taux %","Libellés \ndes évaluations","Modes de preuve \net commentaires",null,null,null,null,null,null,null,null,null,null,null,null,null,null,null,"Choix proposé","A faire en manuel\nN° du choix croissant selon son  Ordre Alphabétique : 1 à …"]
["Art. 4","Contexte de l'organisme",{"$f":"P11","v":"Insuffisant"},{"$f":"O11","v":0},{"$f":"IFERROR(IF(D11<='Mode Emploi'!$G$17,'Mode Emploi'!$I$17,IF(D11<='Mode Emploi'!$G$18,'Mode Emploi'!$I$18,IF(D11<='Mode Emploi'!$G$19,'Mode Emploi'!$I$19,'Mode Emploi'!$I$20))),\"\")","v":"Conformité de niveau 1 : Il est nécessaire de formaliser les activités réalisées."},null,null,"Article",null,null,null,null,"vérifier si Somme = 1 =>  ",{"$f":"SUM(N12:N32)","v":1},{"$f":"IFERROR(SUM(O12:O32),\"\")","v":0},{"$f":"IFERROR(IF(O11<='Mode Emploi'!$G$17,'Mode Emploi'!$H$17,IF(O11<='Mode Emploi'!$G$18,'Mode Emploi'!$H$18,IF(O11<='Mode Emploi'!$G$19,'Mode Emploi'!$H$19,'Mode Emploi'!$H$20))),\"\")","v":"Insuffisant"},{"$f":"1/7","v":0.14285714285714285},{"$f":"O11*Q11","v":0},null,null,null,"Choix de \nVÉRACITÉ",1]
["4.1","Compréhension de l'organisme et de son contexte",{"$f":"M12","v":"Insuffisant"},{"$f":"L12","v":0},{"$f":"IFERROR(IF(D12<='Mode Emploi'!$G$17,'Mode Emploi'!$I$17,IF(D12<='Mode Emploi'!$G$18,'Mode Emploi'!$I$18,IF(D12<='Mode Emploi'!$G$19,'Mode Emploi'!$I$19,'Mode Emploi'!$I$20))),\"\")","v":"Conformité de niveau 1 : Il est nécessaire de formaliser les activités réalisées."},null,"Nb critères","Sous-Article",null,"vérifier si Somme = 1 =>  ",{"$f":"SUM(K13:K15)","v":1},{"$f":"IFERROR(SUM(L13:L15),\"\")","v":0},{"$f":"IFERROR(IF(L12<='Mode Emploi'!$G$17,'Mode Emploi'!$H$17,IF(L12<='Mode Emploi'!$G$18,'Mode Emploi'!$H$18,IF(L12<='Mode Emploi'!$G$19,'Mode Emploi'!$H$19,'Mode Emploi'!$H$20))),\"\")","v":"Insuffisant"},{"$f":"1/COUNTA($M$12:$M$32)","v":0.25},{"$f":"N12*L12","v":0},null,null,null,null,null,null,"Faux",2,null,null,null,null,null,"Légende"]
["cr 1","Les enjeux internes et externes sont déterminés relativement à la finalité et l'orientation stratégique de l'organisme","Choix de \nVÉRACITÉ",{"$f":"J13","v":""},{"$f":"CHOOSE(I13,\"Libellé du critère quand il sera choisi\",'Mode Emploi'!$B$17,'Mode Emploi'!$B$18,'Mode Emploi'!$B$19,'Mode Emploi'!$B$20,,)","v":"Libellé du critère quand il sera choisi"},null,1,{"$f":"C13","v":"Choix de \nVÉRACITÉ"},{"$f":"IFERROR((VLOOKUP(C13,'Mode Emploi'!$M$16:$N$20,2)),\"\")","v":1},{"$f":"IFERROR(CHOOSE(I13,\"\",'Mode Emploi'!$E$17,'Mode Emploi'!$E$18,'Mode Emploi'!$E$19,'Mode Emploi'!$E$20,),\"\")","v":""},{"$f":"1/COUNTA($B$13:$B$15)","v":0.33333333333333331},{"$f":"IFERROR(J13*K13,\"\")","v":""},null,null,null,null,null,null,null,null,null,"Plutôt Faux",3,null,null,null,null,null,null,"Evolutions sans impact ou à impact limité"]
[{"$f":"CONCATENATE(\"cr \",MID(A13,3,4)+1)","v":"cr 2"},"Les informations relatives aux enjeux externes et internes sont surveillées et revues périodiquement","Choix de \nVÉRACITÉ",{"$f":"J14","v":""},{"$f":"CHOOSE(I14,\"Libellé du critère quand il sera choisi\",'Mode Emploi'!$B$17,'Mode Emploi'!$B$18,'Mode Emploi'!$B$19,'Mode Emploi'!$B$20,,)","v":"Libellé du critère quand il sera choisi"},null,{"$f":"G13+1","v":2},{"$f":"C14","v":"Choix de \nVÉRACITÉ"},{"$f":"IFERROR((VLOOKUP(C14,'Mode Emploi'!$M$16:$N$20,2)),\"\")","v":1},{"$f":"IFERROR(CHOOSE(I14,\"\",'Mode Emploi'!$E$17,'Mode Emploi'!$E$18,'Mode Emploi'!$E$19,'Mode Emploi'!$E$20,),\"\")","v":""},{"$f":"1/COUNTA($B$13:$B$15)","v":0.33333333333333331},{"$f":"IFERROR(J14*K14,\"\")","v":""},null,null,null,null,null,null,null,null,null,"Plutôt Vrai",4,null,null,null,null,null,null,"Evolutions à impact moyen"]
[{"$f":"CONCATENATE(\"cr \",MID(A14,3,4)+1)","v":"cr 3"},"Les facteurs d'influence sur l'efficacté du Système de Management de la Qualité (SMQ) sont identifiés","Choix de \nVÉRACITÉ",{"$f":"J15","v":""},{"$f":"CHOOSE(I15,\"Libellé du critère quand il sera choisi\",'Mode Emploi'!$B$17,'Mode Emploi'!$B$18,'Mode Emploi'!$B$19,'Mode Emploi'!$B$20,,)","v":"Libellé du critère quand il sera choisi"},null,{"$f":"G14+1","v":3},{"$f":"C15","v":"Choix de \nVÉRACITÉ"},{"$f":"IFERROR((VLOOKUP(C15,'Mode Emploi'!$M$16:$N$20,2)),\"\")","v":1},{"$f":"IFERROR(CHOOSE(I15,\"\",'Mode Emploi'!$E$17,'Mode Emploi'!$E$18,'Mode Emploi'!$E$19,'Mode Emploi'!$E$20,),\"\")","v":""},{"$f":"1/COUNTA($B$13:$B$15)","v":0.33333333333333331},{"$f":"IFERROR(J15*K15,\"\")","v":""},null,null,null,null,null,null,null,null,null,"Vrai",5,null,null,null,null,null,null,"Evolutions à fort impact"]
{"$rows_left_out":185}
{"sheet":"Résultats globaux","index":2,"n_rows":68,"n_cols":19,"rows_kept":68,"cut":false,"hidden":false,"merged":[[3,0,3,3],[5,0,5,1],[6,0,6,1],[5,2,5,3],[23,5,23,7],[15,0,15,3],[5,6,6,7],[13,0,13,3],[9,4,9,7],[4,0,4,1],[4,2,4,3],[14,0,14,3],[22,0,22,4],[22,5,22,7],[8,0,8,7],[21,0,21,7],[9,0,9,3],[24,5,24,7],[30,0,30,7],[28,0,28,4]]}
[{"$f":"'Mode Emploi'!B1","v":"Document d'appui à la déclaration première partie de conformité à la norme ISO 9001:2015"},null,null,null,null,null,null,"Impression sur pages A4 100% en format horizontal"]
[null,null,null,null,{"$f":"'Mode Emploi'!D2","v":"   Autodiagnostic selon la norme ISO 9001:2015"}]
[]
["Informations sur le Service Management de la Qualité",null,null,null,null,null,"Informations sur l'Autodiagnostic"]
[{"$f":"'Mode Emploi'!B5","v":"Etablissement :"},null,{"$f":"'Mode Emploi'!E5","v":"Nom de l'établissement / entreprise / organisation..."},null,{"$f":"Exigences!A4","v":"Date de l'autodiagnostic : "},{"$f":"IF(Exigences!C4=\"\",\"\",Exigences!C4)","v":""},{"$f":"Exigences!A7","v":"L'équipe :"}]
[{"$f":"'Mode Emploi'!B6","v":" Responsable du SMQ : "},null,{"$f":"'Mode Emploi'!E6","v":"NOM et Prénom du Responsable Qualité"},null,"Responsable : ",{"$f":"IF(Exigences!C5=\"\",\"\",Exigences!C5)","v":"NOM et Prénom"},{"$f":"Exigences!C7","v":"Noms et Prénoms des participants"}]
[null,null,{"$f":"'Mode Emploi'!E7","v":"email :"},{"$f":"'Mode Emploi'!I7","v":"Tél :"},{"$f":"IF(Exigences!C6=\"\",\"\",Exigences!C6)","v":"Tél :"},{"$f":"IF(Exigences!E6=\"\",\"\",Exigences!E6)","v":"@ :"}]
[]
["TABLEAUX DE BORD sur les niveaux de CONFORMITÉ et de RÉALISATION selon les exigences de la norme ISO 9001:2015",null,null,null,null,null,null,null,null,null,null,null,"Utilitaires pour les CALCULS et les GRAPHIQUES"]
[{"$f":"CONCATENATE(\"Niveaux de VÉRACITÉ des \", S13, \" critères d'exigence \")","v":"Niveaux de VÉRACITÉ des 154 critères d'exigence "},null,null,null,"Niveaux de CONFORMITÉ des ARTICLES aux exigences de la norme"]
[null,null,null,null,null,"Moyenne générale :",{"$f":"G33","v":0},{"$f":"E33","v":"Insuffisant"},null,null,"Histogramme des niveaux de CONFORMITÉ",null,null,null,null,"Histogramme des niveaux de VÉRACITÉ"]
[null,null,null,null,null,null,null,null,null,null,"CONFORMITÉ","Nb d'Articles","Tracer la moyenne",null,"VÉRACITÉ",null,"Nb de critères d'exigences","Ecart vs Total des critères","Total des critères"]
[null,null,null,null,null,null,null,null,null,null,"Niveaux",{"$f":"SUM(L14:L17)","v":28},": Total ou 0",null,"Niveaux","N°",{"$f":"SUM(Q14:Q17)","v":0},{"$f":"154-Q13","v":154},{"$f":"MAX(Exigences!G1:G200)","v":154}]
[{"$f":"IF(Q13<S13,CONCATENATE(\"Attention : \",R13,\" critères ne sont pas encore traités\"),\"\")","v":"Attention : 154 critères ne sont pas encore traités"},null,null,null,null,null,null,null,null,null,{"$f":"'Mode Emploi'!H17","v":"Insuffisant"},{"$f":"IFERROR(COUNTIFS($F$35:$F$68,K14),0)","v":28},{"$f":"IF($E$33=K14,30,0)","v":30},null,"Faux",{"$f":"'Mode Emploi'!N17","v":2},{"$f":"IFERROR(COUNTIFS(Exigences!$I$13:$I$199,$P14),0)","v":0}]
["Niveaux de CONFORMITÉ des 28 SOUS-ARTICLES de la norme (et Moyenne)",null,null,null,null,null,null,null,null,null,{"$f":"'Mode Emploi'!H18","v":"Informel"},{"$f":"IFERROR(COUNTIFS($F$35:$F$68,K15),0)","v":0},{"$f":"IF($E$33=K15,30,0)","v":0},null,"Plutôt Faux",{"$f":"'Mode Emploi'!N18","v":3},{"$f":"IFERROR(COUNTIFS(Exigences!$I$13:$I$199,$P15),0)","v":0}]
{"$rows_left_out":54}
{"sheet":"Résultats par Article","index":3,"n_rows":70,"n_cols":8,"rows_kept":70,"cut":false,"hidden":false,"merged":[[3,0,3,3],[4,0,4,1],[4,2,4,3],[5,6,6,7],[9,5,9,7],[37,5,37,7],[38,5,38,7],[10,5,10,7],[11,5,11,7],[5,0,5,1],[5,2,5,3],[6,0,6,1],[18,5,18,7],[19,5,19,7],[20,5,20,7],[27,5,27,7],[28,5,28,7],[29,5,29,7],[36,5,36,7],[65,5,65,7],[54,5,54,7],[55,5,55,7],[56,5,56,7],[45,5,45,7],[46,5,46,7],[47,5,47,7],[63,5,63,7],[64,5,64,7]]}
[{"$f":"'Mode Emploi'!B1","v":"Document d'appui à la déclaration première partie de conformité à la norme ISO 9001:2015"},null,null,null,null,null,null,"Impression sur pages A4 100% en format horizontal"]
[null,null,null,null,"  Résultats détaillés par ARTICLE de l'autodiagnostic selon la norme ISO 9001:2015"]
[]
["Informations sur le Service Management de la Qualité",null,null,null,null,null,"Informations sur l'Autodiagnostic"]
[{"$f":"'Mode Emploi'!B5","v":"Etablissement :"},null,{"$f":"'Mode Emploi'!E5","v":"Nom de l'établissement / entreprise / organisation..."},null,{"$f":"Exigences!A4","v":"Date de l'autodiagnostic : "},{"$f":"IF(Exigences!C4=\"\",\"\",Exigences!C4)","v":""},{"$f":"Exigences!A7","v":"L'équipe :"}]
[{"$f":"'Mode Emploi'!B6","v":" Responsable du SMQ : "},null,{"$f":"'Mode Emploi'!E6","v":"NOM et Prénom du Responsable Qualité"},null,"Responsable : ",{"$f":"IF(Exigences!C5=\"\",\"\",Exigences!C5)","v":"NOM et Prénom"},{"$f":"Exigences!C7","v":"Noms et Prénoms des participants"}]
[null,null,{"$f":"'Mode Emploi'!E7","v":"email :"},{"$f":"'Mode Emploi'!I7","v":"Tél :"},{"$f":"IF(Exigences!C6=\"\",\"\",Exigences!C6)","v":"Tél :"},{"$f":"IF(Exigences!E6=\"\",\"\",Exigences!E6)","v":"@ :"}]
[]
[null,{"$f":"Exigences!A11","v":"Art. 4"},{"$f":"Exigences!B11","v":"Contexte de l'organisme"}]
[null,"Niveau d'évaluation"," Taux de CONFORMITÉ aux critères d'exigence",null,null,"COMMENTAIRES sur les RÉSULTATS obtenus"]
[null,{"$f":"'Résultats globaux'!E34","v":"Insuffisant"},{"$f":"'Résultats globaux'!G34","v":0},null,null,"Commentaires (collectifs si possible)  :"]
[null,null,null,null,null,"DÉCISIONS : Plans d'action PRIORITAIRES"]
[null,null,null,null,null,"QUOI\nObjectifs à atteindre","QUI\nen Interne ou en Externe","QUAND ET OÙ\nDate et Champ d'application"]
[null,null,null,null,null,"Plan n°1 :"]
[null,null,null,null,null,"Plan n°2 :"]
{"$rows_left_out":56}
{"sheet":"Conseils","index":4,"n_rows":40,"n_cols":7,"rows_kept":40,"cut":false,"hidden":true,"merged":[[3,0,3,2],[37,4,39,4],[6,4,9,4],[11,4,13,4],[15,4,17,4],[19,4,23,4],[25,4,31,4],[6,3,9,3],[11,3,13,3],[15,3,17,3],[19,3,23,3],[25,3,31,3],[33,3,35,3],[37,3,39,3],[10,0,10,4],[36,0,36,4],[8,6,10,6],[11,6,14,6],[15,6,17,6],[33,4,35,4],[5,0,5,4],[14,0,14,4],[18,0,18,4],[24,0,24,4],[32,0,32,4]]}
[null,null,null,"   Autodiagnostic selon la norme ISO 9001:2015"]
[null,null,null,"\"Systèmes de management de la qualité - Exigences\", édition  Afnor, www.afnor.org, octobre 2015"]
[]
[null,null,null,"Quelques CONSEILS pour atteindre le respect des exigences..."]
[null,null,"Articles","Quoi","Qui"]
["Art. 4    Contexte de l'organisme"]
[null,"4.1","Compréhension de l'organisme et de son contexte","L’organisme doit déterminer les enjeux externes et internes liés au contexte socio-économique dans lequel il se situe. De plus, les parties intéressées doivent être identifiées ainsi que leurs attentes et exigences. Ces dernières seront listées et revus périodiquement. Les champs d'application du système de management de la qualité (SMQ) sont fixés, ainsi que l'ensemble des processus nécessaires à la mise en oeuvre de ce système.","Responsable Qualité et Direction Générale"]
[null,"4.2","Compréhension des besoins et des attentes des parties intéressées",null,null,null,"Cartographie de Processus "]
[null,"4.3","Détermination du domaine d'application du SMQ",null,null,null,"Lien: Master puis \"Travaux\", \"Qualité- Management\", Réf: 338"]
[null,"4.4","Système de Management de la Qualité et ses processus"]
["Art. 5    Leadership"]
[null,"5.1","Leadership et engagement","Dans cet article, la responsabilité de la direction est de communiquer et mettre à disposition sa politique qualité qu'elle appliquera et mettra à jour par la suite. L'engagement de la direction consiste aussi à attribuer les responsabilités et les autorités au sein de l'organisme afin d'appliquer sa politique qualité.","Responsable Qualité et Direction Générale",null,"http://www.utc.fr/master-qualite/public/publications/qualite_et_management/MQ_M2/2015-2016/MIM_projets/qpo12_2016_gp09_ISO_9001v2015/index.html"]
[null,"5.2","Politique "]
[null,"5.3","Rôles, responsabilités et autorités au sein de l'organisme"]
["Art. 6    Planification "]
{"$rows_left_out":26}
{"sheet":"Plans d'action détaillés","index":5,"n_rows":53,"n_cols":14,"rows_kept":53,"cut":false,"hidden":true,"merged":[[0,1,0,13],[2,0,4,0],[47,0,48,0],[49,0,50,0],[51,0,52,0],[33,0,34,0],[36,0,37,0],[38,0,39,0],[40,0,41,0],[42,0,43,0],[45,0,46,0],[19,0,20,0],[21,0,22,0],[23,0,24,0],[27,0,28,0],[29,0,30,0],[31,0,32,0],[5,9,5,12],[8,0,9,0],[10,0,11,0],[12,0,13,0],[14,0,15,0],[17,0,18,0]]}
[null,"  Autodiagnostic sur les exigences de l'ISO 9001:2015"]
[]
["Logo Entreprise ",null,"Date D'audit: "]
[null,null,"Responsable: ",null,null,"Date courante :",null,null,"     PLANIFIER ET FAIRE"]
[null,null,"Service: ",null,null,"Semaine courante :",null,null,null,null,null,null,{"$f":"SUM(M9:M16,M18:M25,M28:M35,M37:M44,M46:M53)","v":11}]
[null,null,{"$f":"COUNTBLANK(C9:C16)+COUNTBLANK(C18:C25)+COUNTBLANK(C28:C35)+COUNTBLANK(C37:C44)+COUNTBLANK(C46:C53)","v":40},null,null,null,null,null,null,"AVANCEMENT"]
["Désignation du Problème","N°","Action","Pilote","Moyens","Gain Estimé","Gain Réalisé","Debut (semaine)","Durée  (semaine)",0.25,0.5,0.75,1,"Commentaires"]
["ZONE / Processus…."]
[null,1,null,null,null,null,null,null,null,1,1,1,1," "]
[null,2,null,null,null,null,null,null,null,1,0,null,null," "]
[null,1,null,null,null,null,null,null,null,1,1,1,1," "]
[null,2,null,null,null,null,null,null,null,null,null,null,null," "]
[null,1,null,null,null,null,null,null,null,1,1,1,1]
[null,2,null," ",null,null,null,null,null,1,1,1,1," "]
[null,1]
{"$rows_left_out":39}
{"sheet":"Déclaration ISO 17050","index":6,"n_rows":37,"n_cols":6,"rows_kept":37,"cut":false,"hidden":true,"merged":[[1,0,1,5],[2,0,2,5],[3,0,3,2],[3,3,3,5],[4,0,4,2],[4,3,4,5],[6,0,6,5],[7,0,7,5],[8,0,8,5],[9,0,9,5],[10,0,10,3],[11,0,11,3],[20,0,20,5],[21,0,21,5],[22,0,22,2],[22,3,22,5],[23,0,23,2],[23,3,23,5],[24,0,24,2],[24,3,24,5],[26,0,26,5],[28,0,28,2],[28,3,28,5],[30,0,30,2],[30,3,30,5],[35,0,35,2],[31,0,31,2],[31,3,31,5],[32,0,32,2],[32,3,32,5],[33,0,33,2],[33,3,33,4]]}
[" Fiche de déclaration de conformité par une première partie - norme ISO 17050",null,null,null,null,"Enregistrement qualité : impression sur 1 page A4 100% en vertical"]
["Déclaration de conformité selon la norme NF EN ISO 17050 Partie 1 : Exigences générales"]
["Évaluation de la conformité - Déclaration de conformité du fournisseur (NF EN ISO/CEI 17050-1)"]
["Date limite de validité de la déclaration :",null,null,"Référence unique de la déclaration ISO 17050 :"]
[{"$f":"IFERROR(A36+364,\"Date de la déclaration + 1 an\")","v":"Date de la déclaration + 1 an"},null,null,{"$f":"IF(A36=\"\",\"remplir la cellule de date de la déclaration (onglet ISO 17050)\",IF(ISERROR(YEAR(A36)),\"date de la déclaration invalide\",CONCATENATE(\"Autodeclaration_ISO_17050_sur_la_NF_S99-170_en_\",YEAR(A36),\"_\",MONTH(A36),\"_\",DAY(A36))))","v":"date de la déclaration invalide"}]
[]
["Objet de la déclaration : Niveau de CONFORMITÉ aux EXIGENCES de la norme NF EN ISO 9001:2015"]
[{"$f":"'Mode Emploi'!E5","v":"Nom de l'établissement / entreprise / organisation..."}]
["Nous soussigés, déclarons sous notre propre responsabilité que les niveaux de conformité de nos pratiques professionnelles ont été mesurés d'après les exigences de la norme NF EN ISO 9001:2015."]
["Nous avons appliqué la meilleure rigueur d'élaboration et d'analyse (évaluation par plusieurs personnes compétentes) et nous avons respecté les règles d'éthique professionnelle (absence de conflits d'intérêt, respect des opinions, liberté des choix) pour parvenir aux résultats ci-dessous."]
["Tableau des résultats de CONFORMITÉ de nos activités \nselon les critères d'exigence tirés de la norme NF EN ISO 9001:2015",null,null,null,"Taux moyen","Niveaux de Conformité"]
[{"$f":"'Résultats globaux'!B33","v":"Niveau moyen sur l'ensemble des articles de la norme ISO 9001:2015 :"},null,null,null,{"$f":"'Résultats globaux'!G33","v":0},{"$f":"IF('Résultats globaux'!$E$33='Mode Emploi'!$H$20,'Résultats globaux'!$E$33,\"Non déclarable\")","v":"Non déclarable"}]
[{"$f":"'Résultats globaux'!A34","v":"Art. 4"},{"$f":"Exigences!B11","v":"Contexte de l'organisme"},null,null,{"$f":"'Résultats globaux'!G34","v":0},{"$f":"IF('Résultats globaux'!E34='Mode Emploi'!$H$20,'Résultats globaux'!E34,\"Non déclarable\")","v":"Non déclarable"}]
[{"$f":"'Résultats globaux'!A39","v":"Art. 5"},{"$f":"Exigences!B33","v":"Leadership"},null,null,{"$f":"'Résultats globaux'!G39","v":0},{"$f":"IF('Résultats globaux'!E39='Mode Emploi'!$H$20,'Résultats globaux'!E39,\"Non déclarable\")","v":"Non déclarable"}]
[{"$f":"'Résultats globaux'!A43","v":"Art. 6"},{"$f":"Exigences!B48","v":"Planification"},null,null,{"$f":"'Résultats globaux'!G43","v":0},{"$f":"IF('Résultats globaux'!E43='Mode Emploi'!$H$20,'Résultats globaux'!E43,\"Non déclarable\")","v":"Non déclarable"}]
{"$rows_left_out":22}